{"text_format":"1","workbook":"xlsx","n_sheets":10,"sheets":["👩🏻‍🏫 Paramêtres","🗂 Base de données prestations","📋 Devis","🧾 Factures","💰 Livre de recettes","📊Tableau de Bord","pour vous 1","pour vous 2","pour vous 3","coulisses"],"not_rendered":{"charts":4,"images":1,"macros":1,"external_links":0,"defined_names":3,"comments":0,"pivot_tables":0},"unopened":[],"bounds":{"document_bytes":16777216,"sheet_cells":100000,"rows_first":2000,"rows_last":500,"rows_between":2000,"halvings":0,"cell_chars":16384,"cell_head_chars":4096},"cells_cut":0,"cells_raw":0,"read":"whole","date_system":"1900"}

{"sheet":"👩🏻‍🏫 Paramêtres","index":0,"n_rows":54,"n_cols":11,"rows_kept":54,"cut":false,"hidden":false,"merged":[[4,3,4,8],[9,3,9,8],[24,3,24,8],[53,1,53,8],[50,1,52,1],[50,3,50,8],[51,3,51,8],[52,3,52,8],[13,3,13,8],[37,3,37,8]]}
[null,null,null,null,null,"Bienvenue",{"$f":"$I$7&\" !\"","v":" !"},null,{"$f":"K7","v":0}]
[]
[]
[]
[null,"👩🏻‍🏫",null,"Bonjour et merci d'avoir téléchargé ce fichier ! Je m'appelle Laure, et vous ? Tapez votre nom dans la case violette et choisissez votre icône dans la liste en cliquant sur l'emoji ! Vous pouvez aussi copier-coller un emoji, à partir d'un site comme getemoji.com par exemple."]
[]
[null,null,null,null,null,null,"Bonjour ! Je m'appelle"]
[]
[null,{"$f":"$B$5","v":"👩🏻‍🏫"},null,{"$f":"\"Enchantée \"&I7&\" !\"","v":"Enchantée  !"}]
[null,{"$f":"$B$5","v":"👩🏻‍🏫"},null,"Comment s'appelle votre micro-entreprise ? "]
[]
[null,null,null,null,null,null,"Ma micro-entreprise s'appelle",null,null,null,{"$f":"$K$7","v":0}]
[]
[null,{"$f":"$B$5","v":"👩🏻‍🏫"},null,"Dites-moi maintenant les informations de facturations suivantes :"]
[]
{"$rows_left_out":40}
{"sheet":"🗂 Base de données prestations","index":1,"n_rows":601,"n_cols":31,"rows_kept":601,"cut":false,"hidden":false,"merged":[]}
["Numéro","Nom","Prénom","Entreprise","Type de client","Date prestation/vente","Numéro de devis","Devis €","Statut","Biais mise en relation","Catégorie de prestation","Libellé","Numéro de facture","Date de facturation","Facture €","Mode de règlement","Adresse de facturation - ligne 1","Adresse de facturation - ligne 2","Code postal et ville","SIRET client","Téléphone","Mail","Date premier contact","Commentaires1","Date second contact","Commentaires2","Date troisième contact","Commentaires3","Divers","Divers2","Divers3"]
[1]
[2]
[3]
[4]
[5]
[6]
[7]
[8]
[9]
[10]
[11,null,null," ",null," ",null,null,null,null,null," ",null," "]
[12,null,null," ",null," ",null,null,null,null,null," ",null," "]
[13,null,null," ",null," ",null,null,null,null,null," ",null," "]
[14,null,null," ",null," ",null,null,null,null,null," ",null," "]
{"$rows_left_out":587}
{"sheet":"📋 Devis","index":2,"n_rows":32,"n_cols":12,"rows_kept":32,"cut":false,"hidden":false,"merged":[[15,8,16,8],[17,2,17,5],[18,2,18,5],[19,2,19,5],[1,6,2,7],[1,8,2,8],[6,1,6,3],[15,1,16,1],[15,2,16,5],[15,6,16,6],[15,7,16,7],[20,2,20,5],[23,6,23,8],[31,1,31,8],[39,1,39,8],[40,1,40,8],[32,1,32,8],[22,1,23,5]]}
[]
[null,{"$f":"'👩🏻‍🏫 Paramêtres'!I16","v":0},null,null,null,null,"DEVIS N° ",null,{"$f":"VLOOKUP(M18,'🗂 Base de données prestations'!A:V,7,FALSE)","v":{"$error":"#N/A"}}]
[null,{"$f":"'👩🏻‍🏫 Paramêtres'!I12","v":0}]
[null,{"$f":"'👩🏻‍🏫 Paramêtres'!I17","v":0}]
[null,{"$f":"'👩🏻‍🏫 Paramêtres'!I18","v":0}]
[null,{"$f":"'👩🏻‍🏫 Paramêtres'!I19&\" \"&'👩🏻‍🏫 Paramêtres'!I20","v":" "},null,null,null,null,{"$f":"IF(VLOOKUP(M18,'🗂 Base de données prestations'!A:V,4,FALSE)=0,\"\",VLOOKUP(M18,'🗂 Base de données prestations'!A:V,4,FALSE))","v":{"$error":"#N/A"}}]
[null,{"$f":"'👩🏻‍🏫 Paramêtres'!I22","v":0},null,null,null,null,{"$f":"VLOOKUP(M18,'🗂 Base de données prestations'!A:U,2,FALSE)&\" \"&VLOOKUP('📋 Devis'!M18,'🗂 Base de données prestations'!A:V,3,FALSE)","v":{"$error":"#N/A"}}]
[null,null,null,null,null,null,{"$f":"VLOOKUP(M18,'🗂 Base de données prestations'!A:U,17,FALSE)","v":{"$error":"#N/A"}}]
[null,null,null,null,null,null,{"$f":"IF(VLOOKUP(M18,'🗂 Base de données prestations'!A:U,18,FALSE)=0,\"\",VLOOKUP(M18,'🗂 Base de données prestations'!A:U,18,FALSE))","v":{"$error":"#N/A"}}]
[null,{"$f":"'👩🏻‍🏫 Paramêtres'!I21","v":0},null,null,null,null,{"$f":"IF(VLOOKUP(M18,'🗂 Base de données prestations'!A:U,19,FALSE)=0,\"\",VLOOKUP(M18,'🗂 Base de données prestations'!A:U,19,FALSE))","v":{"$error":"#N/A"}}]
[null,{"$f":"\"SIRET - \"&'👩🏻‍🏫 Paramêtres'!I23","v":"SIRET - "},null,null,null,null,{"$f":"IF(VLOOKUP(M18,'🗂 Base de données prestations'!A:V,22,FALSE)=0,\"\",VLOOKUP(M18,'🗂 Base de données prestations'!A:V,22,FALSE))","v":{"$error":"#N/A"}}]
[]
[null,null,null,null,null,null,{"$f":"\"A \"&'👩🏻‍🏫 Paramêtres'!I20&\", le\"","v":"A , le"},null,{"$f":"TODAY()","v":"2023-07-21"}]
[]
[]
{"$rows_left_out":18}
{"sheet":"🧾 Factures","index":3,"n_rows":35,"n_cols":12,"rows_kept":35,"cut":false,"hidden":false,"merged":[[1,8,2,8],[15,8,16,8],[17,2,17,5],[18,2,18,5],[19,2,19,5],[20,2,20,5],[1,6,2,7],[15,1,16,1],[15,2,16,5],[15,6,16,6],[15,7,16,7],[6,1,6,3],[25,1,25,2],[25,6,25,8],[42,1,42,8],[43,1,43,8],[34,1,35,8]]}
[]
[null,{"$f":"'👩🏻‍🏫 Paramêtres'!I16","v":0},null,null,null,null,"FACTURE N° ",null,{"$f":"VLOOKUP(M18,'🗂 Base de données prestations'!A:V,13,FALSE)","v":{"$error":"#N/A"}}]
[null,{"$f":"'👩🏻‍🏫 Paramêtres'!I12","v":0}]
[null,{"$f":"'👩🏻‍🏫 Paramêtres'!I17","v":0}]
[null,{"$f":"'👩🏻‍🏫 Paramêtres'!I18","v":0}]
[null,{"$f":"'👩🏻‍🏫 Paramêtres'!I19&\" \"&'👩🏻‍🏫 Paramêtres'!I20","v":" "},null,null,null,null,{"$f":"IF(VLOOKUP(M18,'🗂 Base de données prestations'!A:V,4,FALSE)=0,\"\",VLOOKUP(M18,'🗂 Base de données prestations'!A:V,4,FALSE))","v":{"$error":"#N/A"}}]
[null,{"$f":"'👩🏻‍🏫 Paramêtres'!I22","v":0},null,null,null,null,{"$f":"VLOOKUP(M18,'🗂 Base de données prestations'!A:V,2,FALSE)&\" \"&VLOOKUP(M18,'🗂 Base de données prestations'!A:V,3,FALSE)","v":{"$error":"#N/A"}}]
[null,null,null,null,null,null,{"$f":"VLOOKUP(M18,'🗂 Base de données prestations'!A:U,17,FALSE)","v":{"$error":"#N/A"}}]
[null,null,null,null,null,null,{"$f":"IF(VLOOKUP(M18,'🗂 Base de données prestations'!A:U,18,FALSE)=0,\"\",VLOOKUP(M18,'🗂 Base de données prestations'!A:U,18,FALSE))","v":{"$error":"#N/A"}}]
[null,{"$f":"'👩🏻‍🏫 Paramêtres'!I21","v":0},null,null,null,null,{"$f":"IF(VLOOKUP(M18,'🗂 Base de données prestations'!A:U,19,FALSE)=0,\"\",VLOOKUP(M18,'🗂 Base de données prestations'!A:U,19,FALSE))","v":{"$error":"#N/A"}}]
[null,{"$f":"\"SIRET - \"&'👩🏻‍🏫 Paramêtres'!I23","v":"SIRET - "},null,null,null,null,{"$f":"IF(VLOOKUP(M18,'🗂 Base de données prestations'!A:V,22,FALSE)=0,\"\",VLOOKUP(M18,'🗂 Base de données prestations'!A:V,22,FALSE))","v":{"$error":"#N/A"}}]
[]
[]
[null,null,null,null,null,null,{"$f":"\"A \"&'👩🏻‍🏫 Paramêtres'!I20&\", le\"","v":"A , le"},null,{"$f":"VLOOKUP(M18,'🗂 Base de données prestations'!A:U,14,FALSE)","v":{"$error":"#N/A"}}]
[]
{"$rows_left_out":21}
{"sheet":"💰 Livre de recettes","index":4,"n_rows":200,"n_cols":8,"rows_kept":200,"cut":false,"hidden":false,"merged":[[1,0,1,4]]}
[null,{"$f":"'👩🏻‍🏫 Paramêtres'!K7","v":0},{"$f":"\"Livre de recettes de \"&'👩🏻‍🏫 Paramêtres'!I12","v":"Livre de recettes de "}]
[{"$f":"IF(F2-coulisses!B7=0,\"\",\"Attention le total du livre de recettes est différent du total -encaissé- dans la BdD\")","v":""},null,null,null,null,{"$f":"SUM(recettesnov[Montant])","v":0}]
[]
["N° BdD","Date d'encaissement","Mode de paiement","N°","Entreprise et Libellé","Montant",null,"Mois"]
[null,null,{"$f":"IFERROR(VLOOKUP(A5,'🗂 Base de données prestations'!A:V,16,FALSE),\"\")","v":""},{"$f":"IFERROR(VLOOKUP(A5,'🗂 Base de données prestations'!A:V,13,FALSE),\"\")","v":""},{"$f":"IFERROR(VLOOKUP($A5,'🗂 Base de données prestations'!$A:$V,2,FALSE)&\"  \"&VLOOKUP(A5,'🗂 Base de données prestations'!A:V,3,FALSE)&\" - \"&VLOOKUP(A5,'🗂 Base de données prestations'!A:V,4,FALSE)&\" - \"&VLOOKUP(A5,'🗂 Base de données prestations'!A:V,12,FALSE),\"\")","v":""},{"$f":"IFERROR(VLOOKUP($A5,'🗂 Base de données prestations'!$A:$V,15,FALSE),\" \")","v":" "},null,{"$f":"MONTH(recettesnov[[#This Row],[Date d''encaissement]])","v":1}]
[null,null,{"$f":"IFERROR(VLOOKUP(A6,'🗂 Base de données prestations'!A:V,16,FALSE),\"\")","v":""},{"$f":"IFERROR(VLOOKUP(A6,'🗂 Base de données prestations'!A:V,13,FALSE),\"\")","v":""},{"$f":"IFERROR(VLOOKUP($A6,'🗂 Base de données prestations'!$A:$V,2,FALSE)&\"  \"&VLOOKUP(A6,'🗂 Base de données prestations'!A:V,3,FALSE)&\" - \"&VLOOKUP(A6,'🗂 Base de données prestations'!A:V,4,FALSE)&\" - \"&VLOOKUP(A6,'🗂 Base de données prestations'!A:V,12,FALSE),\"\")","v":""},{"$f":"IFERROR(VLOOKUP($A6,'🗂 Base de données prestations'!$A:$V,15,FALSE),\" \")","v":" "},null,{"$f":"MONTH(recettesnov[[#This Row],[Date d''encaissement]])","v":1}]
[null,null,{"$f":"IFERROR(VLOOKUP(A7,'🗂 Base de données prestations'!A:V,16,FALSE),\"\")","v":""},{"$f":"IFERROR(VLOOKUP(A7,'🗂 Base de données prestations'!A:V,13,FALSE),\"\")","v":""},{"$f":"IFERROR(VLOOKUP($A7,'🗂 Base de données prestations'!$A:$V,2,FALSE)&\"  \"&VLOOKUP(A7,'🗂 Base de données prestations'!A:V,3,FALSE)&\" - \"&VLOOKUP(A7,'🗂 Base de données prestations'!A:V,4,FALSE)&\" - \"&VLOOKUP(A7,'🗂 Base de données prestations'!A:V,12,FALSE),\"\")","v":""},{"$f":"IFERROR(VLOOKUP($A7,'🗂 Base de données prestations'!$A:$V,15,FALSE),\" \")","v":" "},null,{"$f":"MONTH(recettesnov[[#This Row],[Date d''encaissement]])","v":1}]
[null,null,{"$f":"IFERROR(VLOOKUP(A8,'🗂 Base de données prestations'!A:V,16,FALSE),\"\")","v":""},{"$f":"IFERROR(VLOOKUP(A8,'🗂 Base de données prestations'!A:V,13,FALSE),\"\")","v":""},{"$f":"IFERROR(VLOOKUP($A8,'🗂 Base de données prestations'!$A:$V,2,FALSE)&\"  \"&VLOOKUP(A8,'🗂 Base de données prestations'!A:V,3,FALSE)&\" - \"&VLOOKUP(A8,'🗂 Base de données prestations'!A:V,4,FALSE)&\" - \"&VLOOKUP(A8,'🗂 Base de données prestations'!A:V,12,FALSE),\"\")","v":""},{"$f":"IFERROR(VLOOKUP($A8,'🗂 Base de données prestations'!$A:$V,15,FALSE),\" \")","v":" "},null,{"$f":"MONTH(recettesnov[[#This Row],[Date d''encaissement]])","v":1}]
[null,null,{"$f":"IFERROR(VLOOKUP(A9,'🗂 Base de données prestations'!A:V,16,FALSE),\"\")","v":""},{"$f":"IFERROR(VLOOKUP(A9,'🗂 Base de données prestations'!A:V,13,FALSE),\"\")","v":""},{"$f":"IFERROR(VLOOKUP($A9,'🗂 Base de données prestations'!$A:$V,2,FALSE)&\"  \"&VLOOKUP(A9,'🗂 Base de données prestations'!A:V,3,FALSE)&\" - \"&VLOOKUP(A9,'🗂 Base de données prestations'!A:V,4,FALSE)&\" - \"&VLOOKUP(A9,'🗂 Base de données prestations'!A:V,12,FALSE),\"\")","v":""},{"$f":"IFERROR(VLOOKUP($A9,'🗂 Base de données prestations'!$A:$V,15,FALSE),\" \")","v":" "},null,{"$f":"MONTH(recettesnov[[#This Row],[Date d''encaissement]])","v":1}]
[null,null,{"$f":"IFERROR(VLOOKUP(A10,'🗂 Base de données prestations'!A:V,16,FALSE),\"\")","v":""},{"$f":"IFERROR(VLOOKUP(A10,'🗂 Base de données prestations'!A:V,13,FALSE),\"\")","v":""},{"$f":"IFERROR(VLOOKUP($A10,'🗂 Base de données prestations'!$A:$V,2,FALSE)&\"  \"&VLOOKUP(A10,'🗂 Base de données prestations'!A:V,3,FALSE)&\" - \"&VLOOKUP(A10,'🗂 Base de données prestations'!A:V,4,FALSE)&\" - \"&VLOOKUP(A10,'🗂 Base de données prestations'!A:V,12,FALSE),\"\")","v":""},{"$f":"IFERROR(VLOOKUP($A10,'🗂 Base de données prestations'!$A:$V,15,FALSE),\" \")","v":" "},null,{"$f":"MONTH(recettesnov[[#This Row],[Date d''encaissement]])","v":1}]
[null,null,{"$f":"IFERROR(VLOOKUP(A11,'🗂 Base de données prestations'!A:V,16,FALSE),\"\")","v":""},{"$f":"IFERROR(VLOOKUP(A11,'🗂 Base de données prestations'!A:V,13,FALSE),\"\")","v":""},{"$f":"IFERROR(VLOOKUP($A11,'🗂 Base de données prestations'!$A:$V,2,FALSE)&\"  \"&VLOOKUP(A11,'🗂 Base de données prestations'!A:V,3,FALSE)&\" - \"&VLOOKUP(A11,'🗂 Base de données prestations'!A:V,4,FALSE)&\" - \"&VLOOKUP(A11,'🗂 Base de données prestations'!A:V,12,FALSE),\"\")","v":""},{"$f":"IFERROR(VLOOKUP($A11,'🗂 Base de données prestations'!$A:$V,15,FALSE),\" \")","v":" "},null,{"$f":"MONTH(recettesnov[[#This Row],[Date d''encaissement]])","v":1}]
[null,null,{"$f":"IFERROR(VLOOKUP(A12,'🗂 Base de données prestations'!A:V,16,FALSE),\"\")","v":""},{"$f":"IFERROR(VLOOKUP(A12,'🗂 Base de données prestations'!A:V,13,FALSE),\"\")","v":""},{"$f":"IFERROR(VLOOKUP($A12,'🗂 Base de données prestations'!$A:$V,2,FALSE)&\"  \"&VLOOKUP(A12,'🗂 Base de données prestations'!A:V,3,FALSE)&\" - \"&VLOOKUP(A12,'🗂 Base de données prestations'!A:V,4,FALSE)&\" - \"&VLOOKUP(A12,'🗂 Base de données prestations'!A:V,12,FALSE),\"\")","v":""},{"$f":"IFERROR(VLOOKUP($A12,'🗂 Base de données prestations'!$A:$V,15,FALSE),\" \")","v":" "},null,{"$f":"MONTH(recettesnov[[#This Row],[Date d''encaissement]])","v":1}]
[null,null,{"$f":"IFERROR(VLOOKUP(A13,'🗂 Base de données prestations'!A:V,16,FALSE),\"\")","v":""},{"$f":"IFERROR(VLOOKUP(A13,'🗂 Base de données prestations'!A:V,13,FALSE),\"\")","v":""},{"$f":"IFERROR(VLOOKUP($A13,'🗂 Base de données prestations'!$A:$V,2,FALSE)&\"  \"&VLOOKUP(A13,'🗂 Base de données prestations'!A:V,3,FALSE)&\" - \"&VLOOKUP(A13,'🗂 Base de données prestations'!A:V,4,FALSE)&\" - \"&VLOOKUP(A13,'🗂 Base de données prestations'!A:V,12,FALSE),\"\")","v":""},{"$f":"IFERROR(VLOOKUP($A13,'🗂 Base de données prestations'!$A:$V,15,FALSE),\" \")","v":" "},null,{"$f":"MONTH(recettesnov[[#This Row],[Date d''encaissement]])","v":1}]
[null,null,{"$f":"IFERROR(VLOOKUP(A14,'🗂 Base de données prestations'!A:V,16,FALSE),\"\")","v":""},{"$f":"IFERROR(VLOOKUP(A14,'🗂 Base de données prestations'!A:V,13,FALSE),\"\")","v":""},{"$f":"IFERROR(VLOOKUP($A14,'🗂 Base de données prestations'!$A:$V,2,FALSE)&\"  \"&VLOOKUP(A14,'🗂 Base de données prestations'!A:V,3,FALSE)&\" - \"&VLOOKUP(A14,'🗂 Base de données prestations'!A:V,4,FALSE)&\" - \"&VLOOKUP(A14,'🗂 Base de données prestations'!A:V,12,FALSE),\"\")","v":""},{"$f":"IFERROR(VLOOKUP($A14,'🗂 Base de données prestations'!$A:$V,15,FALSE),\" \")","v":" "},null,{"$f":"MONTH(recettesnov[[#This Row],[Date d''encaissement]])","v":1}]
[null,null,{"$f":"IFERROR(VLOOKUP(A15,'🗂 Base de données prestations'!A:V,16,FALSE),\"\")","v":""},{"$f":"IFERROR(VLOOKUP(A15,'🗂 Base de données prestations'!A:V,13,FALSE),\"\")","v":""},{"$f":"IFERROR(VLOOKUP($A15,'🗂 Base de données prestations'!$A:$V,2,FALSE)&\"  \"&VLOOKUP(A15,'🗂 Base de données prestations'!A:V,3,FALSE)&\" - \"&VLOOKUP(A15,'🗂 Base de données prestations'!A:V,4,FALSE)&\" - \"&VLOOKUP(A15,'🗂 Base de données prestations'!A:V,12,FALSE),\"\")","v":""},{"$f":"IFERROR(VLOOKUP($A15,'🗂 Base de données prestations'!$A:$V,15,FALSE),\" \")","v":" "},null,{"$f":"MONTH(recettesnov[[#This Row],[Date d''encaissement]])","v":1}]
{"$rows_left_out":186}
{"sheet":"📊Tableau de Bord","index":5,"n_rows":94,"n_cols":13,"rows_kept":94,"cut":false,"hidden":false,"merged":[[93,2,93,12],[0,0,0,1],[0,2,0,8],[2,2,2,12],[33,2,33,12],[63,2,63,12]]}
[{"$f":"'👩🏻‍🏫 Paramêtres'!K7","v":0},null,{"$f":"\"Tableau de bord de \"&'👩🏻‍🏫 Paramêtres'!I12","v":"Tableau de bord de "}]
[]
[null,"👩🏻‍🏫",{"$f":"\"Sur toute la période, votre chiffre d'affaires encaissé est de \"&coulisses!B7&\" euros. Voici la répartition par mois :\"","v":"Sur toute la période, votre chiffre d'affaires encaissé est de 0 euros. Voici la répartition par mois :"}]
[]
[null,1,2,3,4,5,6,7,8,9,10,11,12]
[null,"Janvier","Février","Mars","Avril","Mai","Juin","Juillet","Août","Sept.","Oct.","Nov.","Déc."]
[]
[null,{"$f":"SUMIF('💰 Livre de recettes'!$H:$H,'📊Tableau de Bord'!B5,'💰 Livre de recettes'!$F:$F)","v":0},{"$f":"SUMIF('💰 Livre de recettes'!$H:$H,'📊Tableau de Bord'!C5,'💰 Livre de recettes'!$F:$F)","v":0},{"$f":"SUMIF('💰 Livre de recettes'!$H:$H,'📊Tableau de Bord'!D5,'💰 Livre de recettes'!$F:$F)","v":0},{"$f":"SUMIF('💰 Livre de recettes'!$H:$H,'📊Tableau de Bord'!E5,'💰 Livre de recettes'!$F:$F)","v":0},{"$f":"SUMIF('💰 Livre de recettes'!$H:$H,'📊Tableau de Bord'!F5,'💰 Livre de recettes'!$F:$F)","v":0},{"$f":"SUMIF('💰 Livre de recettes'!$H:$H,'📊Tableau de Bord'!G5,'💰 Livre de recettes'!$F:$F)","v":0},{"$f":"SUMIF('💰 Livre de recettes'!$H:$H,'📊Tableau de Bord'!H5,'💰 Livre de recettes'!$F:$F)","v":0},{"$f":"SUMIF('💰 Livre de recettes'!$H:$H,'📊Tableau de Bord'!I5,'💰 Livre de recettes'!$F:$F)","v":0},{"$f":"SUMIF('💰 Livre de recettes'!$H:$H,'📊Tableau de Bord'!J5,'💰 Livre de recettes'!$F:$F)","v":0},{"$f":"SUMIF('💰 Livre de recettes'!$H:$H,'📊Tableau de Bord'!K5,'💰 Livre de recettes'!$F:$F)","v":0},{"$f":"SUMIF('💰 Livre de recettes'!$H:$H,'📊Tableau de Bord'!L5,'💰 Livre de recettes'!$F:$F)","v":0},{"$f":"SUMIF('💰 Livre de recettes'!$H:$H,'📊Tableau de Bord'!M5,'💰 Livre de recettes'!$F:$F)","v":0}]
[]
[]
[]
[]
[]
[]
[]
{"$rows_left_out":80}
{"sheet":"pour vous 1","index":6,"n_rows":0,"n_cols":0,"rows_kept":0,"cut":false,"hidden":false,"merged":[]}

{"sheet":"pour vous 2","index":7,"n_rows":0,"n_cols":0,"rows_kept":0,"cut":false,"hidden":false,"merged":[]}

{"sheet":"pour vous 3","index":8,"n_rows":0,"n_cols":0,"rows_kept":0,"cut":false,"hidden":false,"merged":[]}

{"sheet":"coulisses","index":9,"n_rows":38,"n_cols":9,"rows_kept":38,"cut":false,"hidden":true,"merged":[]}
["Somme par statut",null,null,null,"Somme par type de clients",null,null,"Somme par type de presta"]
[]
["prospect",{"$f":"SUMIF('🗂 Base de données prestations'!I:I,coulisses!A3,'🗂 Base de données prestations'!O:O)","v":0},null,null,{"$f":"'👩🏻‍🏫 Paramêtres'!I27","v":0},{"$f":"SUMIFS('🗂 Base de données prestations'!O:O,'🗂 Base de données prestations'!I:I,\"encaissé\",'🗂 Base de données prestations'!E:E,coulisses!E3)","v":0},null,{"$f":"'👩🏻‍🏫 Paramêtres'!I40","v":0},{"$f":"SUMIFS('🗂 Base de données prestations'!O:O,'🗂 Base de données prestations'!I:I,\"encaissé\",'🗂 Base de données prestations'!K:K,coulisses!H3)","v":0}]
["en cours",{"$f":"SUMIF('🗂 Base de données prestations'!I:I,coulisses!A4,'🗂 Base de données prestations'!O:O)","v":0},null,null,{"$f":"'👩🏻‍🏫 Paramêtres'!I28","v":0},{"$f":"SUMIFS('🗂 Base de données prestations'!O:O,'🗂 Base de données prestations'!I:I,\"encaissé\",'🗂 Base de données prestations'!E:E,coulisses!E4)","v":0},null,{"$f":"'👩🏻‍🏫 Paramêtres'!I41","v":0},{"$f":"SUMIFS('🗂 Base de données prestations'!O:O,'🗂 Base de données prestations'!I:I,\"encaissé\",'🗂 Base de données prestations'!K:K,coulisses!H4)","v":0}]
["à facturer",{"$f":"SUMIF('🗂 Base de données prestations'!I:I,coulisses!A5,'🗂 Base de données prestations'!O:O)","v":0},null,null,{"$f":"'👩🏻‍🏫 Paramêtres'!I29","v":0},{"$f":"SUMIFS('🗂 Base de données prestations'!O:O,'🗂 Base de données prestations'!I:I,\"encaissé\",'🗂 Base de données prestations'!E:E,coulisses!E5)","v":0},null,{"$f":"'👩🏻‍🏫 Paramêtres'!I42","v":0},{"$f":"SUMIFS('🗂 Base de données prestations'!O:O,'🗂 Base de données prestations'!I:I,\"encaissé\",'🗂 Base de données prestations'!K:K,coulisses!H5)","v":0}]
["facturé",{"$f":"SUMIF('🗂 Base de données prestations'!I:I,coulisses!A6,'🗂 Base de données prestations'!O:O)","v":0},null,null,{"$f":"'👩🏻‍🏫 Paramêtres'!I30","v":0},{"$f":"SUMIFS('🗂 Base de données prestations'!O:O,'🗂 Base de données prestations'!I:I,\"encaissé\",'🗂 Base de données prestations'!E:E,coulisses!E6)","v":0},null,{"$f":"'👩🏻‍🏫 Paramêtres'!I43","v":0},{"$f":"SUMIFS('🗂 Base de données prestations'!O:O,'🗂 Base de données prestations'!I:I,\"encaissé\",'🗂 Base de données prestations'!K:K,coulisses!H6)","v":0}]
["encaissé",{"$f":"SUMIF('🗂 Base de données prestations'!I:I,coulisses!A7,'🗂 Base de données prestations'!O:O)","v":0},null,null,{"$f":"'👩🏻‍🏫 Paramêtres'!I31","v":0},{"$f":"SUMIFS('🗂 Base de données prestations'!O:O,'🗂 Base de données prestations'!I:I,\"encaissé\",'🗂 Base de données prestations'!E:E,coulisses!E7)","v":0},null,{"$f":"'👩🏻‍🏫 Paramêtres'!I44","v":0},{"$f":"SUMIFS('🗂 Base de données prestations'!O:O,'🗂 Base de données prestations'!I:I,\"encaissé\",'🗂 Base de données prestations'!K:K,coulisses!H7)","v":0}]
["abandonné",{"$f":"SUMIF('🗂 Base de données prestations'!I:I,coulisses!A8,'🗂 Base de données prestations'!O:O)","v":0},null,null,{"$f":"'👩🏻‍🏫 Paramêtres'!I32","v":0},{"$f":"SUMIFS('🗂 Base de données prestations'!O:O,'🗂 Base de données prestations'!I:I,\"encaissé\",'🗂 Base de données prestations'!E:E,coulisses!E8)","v":0},null,{"$f":"'👩🏻‍🏫 Paramêtres'!I45","v":0},{"$f":"SUMIFS('🗂 Base de données prestations'!O:O,'🗂 Base de données prestations'!I:I,\"encaissé\",'🗂 Base de données prestations'!K:K,coulisses!H8)","v":0}]
[null,null,null,null,{"$f":"'👩🏻‍🏫 Paramêtres'!I33","v":0},{"$f":"SUMIFS('🗂 Base de données prestations'!O:O,'🗂 Base de données prestations'!I:I,\"encaissé\",'🗂 Base de données prestations'!E:E,coulisses!E9)","v":0},null,{"$f":"'👩🏻‍🏫 Paramêtres'!I46","v":0},{"$f":"SUMIFS('🗂 Base de données prestations'!O:O,'🗂 Base de données prestations'!I:I,\"encaissé\",'🗂 Base de données prestations'!K:K,coulisses!H9)","v":0}]
["Modes de paiement",null,null,null,{"$f":"'👩🏻‍🏫 Paramêtres'!I34","v":0},{"$f":"SUMIFS('🗂 Base de données prestations'!O:O,'🗂 Base de données prestations'!I:I,\"encaissé\",'🗂 Base de données prestations'!E:E,coulisses!E10)","v":0},null,{"$f":"'👩🏻‍🏫 Paramêtres'!I47","v":0},{"$f":"SUMIFS('🗂 Base de données prestations'!O:O,'🗂 Base de données prestations'!I:I,\"encaissé\",'🗂 Base de données prestations'!K:K,coulisses!H10)","v":0}]
["Espèces",null,null,null,{"$f":"'👩🏻‍🏫 Paramêtres'!I35","v":0},{"$f":"SUMIFS('🗂 Base de données prestations'!O:O,'🗂 Base de données prestations'!I:I,\"encaissé\",'🗂 Base de données prestations'!E:E,coulisses!E11)","v":0},null,{"$f":"'👩🏻‍🏫 Paramêtres'!I48","v":0},{"$f":"SUMIFS('🗂 Base de données prestations'!O:O,'🗂 Base de données prestations'!I:I,\"encaissé\",'🗂 Base de données prestations'!K:K,coulisses!H11)","v":0}]
["Chèque",null,null,null,{"$f":"'👩🏻‍🏫 Paramêtres'!I36","v":0},{"$f":"SUMIFS('🗂 Base de données prestations'!O:O,'🗂 Base de données prestations'!I:I,\"encaissé\",'🗂 Base de données prestations'!E:E,coulisses!E12)","v":0},null,{"$f":"'👩🏻‍🏫 Paramêtres'!I49","v":0},{"$f":"SUMIFS('🗂 Base de données prestations'!O:O,'🗂 Base de données prestations'!I:I,\"encaissé\",'🗂 Base de données prestations'!K:K,coulisses!H12)","v":0}]
["Virement"]
["CB"]
["Paypal"]
{"$rows_left_out":23}