{"text_format":"1","workbook":"xlsx","n_sheets":5,"sheets":["👩🏻‍🏫 Bienvenue !","💶 Recettes et dépenses","📊 Synthèse","🧾 Facture","coulisses"],"not_rendered":{"charts":1,"images":1,"macros":1,"external_links":0,"defined_names":6,"comments":0,"pivot_tables":0},"unopened":[],"bounds":{"document_bytes":16777216,"sheet_cells":100000,"rows_first":2000,"rows_last":500,"rows_between":2000,"halvings":0,"cell_chars":16384,"cell_head_chars":4096},"cells_cut":0,"cells_raw":0,"read":"whole","date_system":"1900"}

{"sheet":"👩🏻‍🏫 Bienvenue !","index":0,"n_rows":25,"n_cols":11,"rows_kept":25,"cut":false,"hidden":false,"merged":[[21,3,21,8],[21,1,23,1],[24,1,24,8],[23,3,23,8],[22,3,22,8],[4,3,4,8],[9,3,9,8],[13,3,13,8],[17,3,17,8],[19,3,19,8]]}
[null,null,null,null,null,"Bienvenue",{"$f":"$I$7&\" !\"","v":" !"},null,{"$f":"K7","v":0}]
[]
[]
[]
[null,"👩🏻‍🏫",null,"Bonjour et merci d'avoir téléchargé ce fichier ! Je m'appelle Laure, et vous ? Tapez votre nom dans la case violette et choisissez votre visage dans la liste en cliquant sur l'emoji !"]
[]
[null,null,null,null,null,null,"Bonjour ! Je m'appelle"]
[]
[null,{"$f":"$B$5","v":"👩🏻‍🏫"},null,{"$f":"\"Enchantée \"&I7&\" !\"","v":"Enchantée  !"}]
[null,{"$f":"$B$5","v":"👩🏻‍🏫"},null,"Comment s'appelle votre micro-entreprise ? "]
[]
[null,null,null,null,null,null,"Ma micro-entreprise s'appelle",null,null,null,{"$f":"$K$7","v":0}]
[]
[null,{"$f":"B5","v":"👩🏻‍🏫"},null,{"$f":"I12&\" ? Joli nom !\" & \" Dites-moi l'année pour laquelle vous allez faire votre comptabilité.\"","v":" ? Joli nom ! Dites-moi l'année pour laquelle vous allez faire votre comptabilité."}]
[]
[null,null,null,null,null,null,null,null,null,null,{"$f":"$K$7","v":0}]
[]
[null,{"$f":"B5","v":"👩🏻‍🏫"},null,"Ok, c'est noté ! Pour utiliser ce fichier, il vous suffit de saisir vos recettes et vos dépenses dans l'onglet \"💶 Recettes et dépenses\" tout en bas de l'écran. Et vous avez ensuite une synthèse de votre chiffre d'affaires, de vos dépenses et de votre profit dans l'onglet \"📊 Synthèse\". Vous pouvez également personnaliser un modèle de facture dans l'onglet dédié."]
[]
[null,null,null,"OK, je vois.",null,null,null,null,null,null,{"$f":"$K$7","v":0}]
[]
[null,{"$f":"B5","v":"👩🏻‍🏫"},null,"Pour rappel, n'oubliez pas d'imprimer en PDF l'onglet \"Recettes et dépenses\" à chaque déclaration, pour être en règle. La date de création du fichier PDF obtenu fera foi en cas de contrôle."]
[null,null,null,{"$f":" \"Je vous souhaite plein de succès avec\"&\" \"&I12&\" ! \"","v":"Je vous souhaite plein de succès avec  ! "}]
[null,null,null,{"$f":"\"A bientôt, \"&I7&\" !\"","v":"A bientôt,  !"}]
[null,"Ce contenu est soumis au droit d’auteur et est la propriété de Comptes & Formules. Toute représentation ou reproduction non autorisée est passible d’une action en contrefaçon. "]

{"sheet":"💶 Recettes et dépenses","index":1,"n_rows":606,"n_cols":15,"rows_kept":606,"cut":false,"hidden":false,"merged":[[3,17,3,20],[3,14,4,14],[3,7,4,7]]}
[null,null,{"$f":"'👩🏻‍🏫 Bienvenue !'!K7","v":0},null,{"$f":" \"La comptabilité de votre micro-entreprise \"&'👩🏻‍🏫 Bienvenue !'!I12&\" - \"&'👩🏻‍🏫 Bienvenue !'!I16","v":"La comptabilité de votre micro-entreprise  - "}]
[]
[]
[null,null,null,null,null,null,"Vos recettes 💰",{"$f":"SUM(H7:H606)","v":0},null,null,null,null,null,"Vos dépenses 🧾",{"$f":"SUM(O7:O606)","v":0}]
[]
["#",null,"Date","Mode de paiement","N°","Client","Libellé","Montant",null,null,"Date","Mode de paiement","N°","Libellé (Fournisseur, nature de la dépense)","Montant"]
[1,{"$f":"MONTH(Tableau1[[#This Row],[Date]])","v":1},null,null,null,null,null,null,null,{"$f":"MONTH(Tableau2[[#This Row],[Date]])","v":1}]
[2,{"$f":"MONTH(Tableau1[[#This Row],[Date]])","v":1},null,null,null,null,null,null,null,{"$f":"MONTH(Tableau2[[#This Row],[Date]])","v":1}]
[3,{"$f":"MONTH(Tableau1[[#This Row],[Date]])","v":1},null,null,null,null,null,null,null,{"$f":"MONTH(Tableau2[[#This Row],[Date]])","v":1}]
[4,{"$f":"MONTH(Tableau1[[#This Row],[Date]])","v":1},null,null,null,null,null,null,null,{"$f":"MONTH(Tableau2[[#This Row],[Date]])","v":1}]
[5,{"$f":"MONTH(Tableau1[[#This Row],[Date]])","v":1},null,null,null,null,null,null,null,{"$f":"MONTH(Tableau2[[#This Row],[Date]])","v":1}]
[6,{"$f":"MONTH(Tableau1[[#This Row],[Date]])","v":1},null,null,null,null,null,null,null,{"$f":"MONTH(Tableau2[[#This Row],[Date]])","v":1}]
[7,{"$f":"MONTH(Tableau1[[#This Row],[Date]])","v":1},null,null,null,null,null,null,null,{"$f":"MONTH(Tableau2[[#This Row],[Date]])","v":1}]
[8,{"$f":"MONTH(Tableau1[[#This Row],[Date]])","v":1},null,null,null,null,null,null,null,{"$f":"MONTH(Tableau2[[#This Row],[Date]])","v":1}]
[9,{"$f":"MONTH(Tableau1[[#This Row],[Date]])","v":1},null,null,null,null,null,null,null,{"$f":"MONTH(Tableau2[[#This Row],[Date]])","v":1}]
[10,{"$f":"MONTH(Tableau1[[#This Row],[Date]])","v":1},null,null,null,null,null,null,null,{"$f":"MONTH(Tableau2[[#This Row],[Date]])","v":1}]
[11,{"$f":"MONTH(Tableau1[[#This Row],[Date]])","v":1},null,null,null,null,null,null,null,{"$f":"MONTH(Tableau2[[#This Row],[Date]])","v":1}]
[12,{"$f":"MONTH(Tableau1[[#This Row],[Date]])","v":1},null,null,null,null,null,null,null,{"$f":"MONTH(Tableau2[[#This Row],[Date]])","v":1}]
[13,{"$f":"MONTH(Tableau1[[#This Row],[Date]])","v":1},null,null,null,null,null,null,null,{"$f":"MONTH(Tableau2[[#This Row],[Date]])","v":1}]
[14,{"$f":"MONTH(Tableau1[[#This Row],[Date]])","v":1},null,null,null,null,null,null,null,{"$f":"MONTH(Tableau2[[#This Row],[Date]])","v":1}]
[15,{"$f":"MONTH(Tableau1[[#This Row],[Date]])","v":1},null,null,null,null,null,null,null,{"$f":"MONTH(Tableau2[[#This Row],[Date]])","v":1}]
[16,{"$f":"MONTH(Tableau1[[#This Row],[Date]])","v":1},null,null,null,null,null,null,null,{"$f":"MONTH(Tableau2[[#This Row],[Date]])","v":1}]
[17,{"$f":"MONTH(Tableau1[[#This Row],[Date]])","v":1},null,null,null,null,null,null,null,{"$f":"MONTH(Tableau2[[#This Row],[Date]])","v":1}]
[18,{"$f":"MONTH(Tableau1[[#This Row],[Date]])","v":1},null,null,null,null,null,null,null,{"$f":"MONTH(Tableau2[[#This Row],[Date]])","v":1}]
[19,{"$f":"MONTH(Tableau1[[#This Row],[Date]])","v":1},null,null,null,null,null,null,null,{"$f":"MONTH(Tableau2[[#This Row],[Date]])","v":1}]
[20,{"$f":"MONTH(Tableau1[[#This Row],[Date]])","v":1},null,null,null,null,null,null,null,{"$f":"MONTH(Tableau2[[#This Row],[Date]])","v":1}]
[21,{"$f":"MONTH(Tableau1[[#This Row],[Date]])","v":1},null,null,null,null,null,null,null,{"$f":"MONTH(Tableau2[[#This Row],[Date]])","v":1}]
[22,{"$f":"MONTH(Tableau1[[#This Row],[Date]])","v":1},null,null,null,null,null,null,null,{"$f":"MONTH(Tableau2[[#This Row],[Date]])","v":1}]
[23,{"$f":"MONTH(Tableau1[[#This Row],[Date]])","v":1},null,null,null,null,null,null,null,{"$f":"MONTH(Tableau2[[#This Row],[Date]])","v":1}]
[24,{"$f":"MONTH(Tableau1[[#This Row],[Date]])","v":1},null,null,null,null,null,null,null,{"$f":"MONTH(Tableau2[[#This Row],[Date]])","v":1}]
[25,{"$f":"MONTH(Tableau1[[#This Row],[Date]])","v":1},null,null,null,null,null,null,null,{"$f":"MONTH(Tableau2[[#This Row],[Date]])","v":1}]
[26,{"$f":"MONTH(Tableau1[[#This Row],[Date]])","v":1},null,null,null,null,null,null,null,{"$f":"MONTH(Tableau2[[#This Row],[Date]])","v":1}]
[27,{"$f":"MONTH(Tableau1[[#This Row],[Date]])","v":1},null,null,null,null,null,null,null,{"$f":"MONTH(Tableau2[[#This Row],[Date]])","v":1}]
[28,{"$f":"MONTH(Tableau1[[#This Row],[Date]])","v":1},null,null,null,null,null,null,null,{"$f":"MONTH(Tableau2[[#This Row],[Date]])","v":1}]
[29,{"$f":"MONTH(Tableau1[[#This Row],[Date]])","v":1},null,null,null,null,null,null,null,{"$f":"MONTH(Tableau2[[#This Row],[Date]])","v":1}]
[30,{"$f":"MONTH(Tableau1[[#This Row],[Date]])","v":1},null,null,null,null,null,null,null,{"$f":"MONTH(Tableau2[[#This Row],[Date]])","v":1}]
[31,{"$f":"MONTH(Tableau1[[#This Row],[Date]])","v":1},null,null,null,null,null,null,null,{"$f":"MONTH(Tableau2[[#This Row],[Date]])","v":1}]
[32,{"$f":"MONTH(Tableau1[[#This Row],[Date]])","v":1},null,null,null,null,null,null,null,{"$f":"MONTH(Tableau2[[#This Row],[Date]])","v":1}]
[33,{"$f":"MONTH(Tableau1[[#This Row],[Date]])","v":1},null,null,null,null,null,null,null,{"$f":"MONTH(Tableau2[[#This Row],[Date]])","v":1}]
[34,{"$f":"MONTH(Tableau1[[#This Row],[Date]])","v":1},null,null,null,null,null,null,null,{"$f":"MONTH(Tableau2[[#This Row],[Date]])","v":1}]
[35,{"$f":"MONTH(Tableau1[[#This Row],[Date]])","v":1},null,null,null,null,null,null,null,{"$f":"MONTH(Tableau2[[#This Row],[Date]])","v":1}]
[36,{"$f":"MONTH(Tableau1[[#This Row],[Date]])","v":1},null,null,null,null,null,null,null,{"$f":"MONTH(Tableau2[[#This Row],[Date]])","v":1}]
[37,{"$f":"MONTH(Tableau1[[#This Row],[Date]])","v":1},null,null,null,null,null,null,null,{"$f":"MONTH(Tableau2[[#This Row],[Date]])","v":1}]
[38,{"$f":"MONTH(Tableau1[[#This Row],[Date]])","v":1},null,null,null,null,null,null,null,{"$f":"MONTH(Tableau2[[#This Row],[Date]])","v":1}]
[39,{"$f":"MONTH(Tableau1[[#This Row],[Date]])","v":1},null,null,null,null,null,null,null,{"$f":"MONTH(Tableau2[[#This Row],[Date]])","v":1}]
[40,{"$f":"MONTH(Tableau1[[#This Row],[Date]])","v":1},null,null,null,null,null,null,null,{"$f":"MONTH(Tableau2[[#This Row],[Date]])","v":1}]
[41,{"$f":"MONTH(Tableau1[[#This Row],[Date]])","v":1},null,null,null,null,null,null,null,{"$f":"MONTH(Tableau2[[#This Row],[Date]])","v":1}]
[42,{"$f":"MONTH(Tableau1[[#This Row],[Date]])","v":1},null,null,null,null,null,null,null,{"$f":"MONTH(Tableau2[[#This Row],[Date]])","v":1}]
[43,{"$f":"MONTH(Tableau1[[#This Row],[Date]])","v":1},null,null,null,null,null,null,null,{"$f":"MONTH(Tableau2[[#This Row],[Date]])","v":1}]
[44,{"$f":"MONTH(Tableau1[[#This Row],[Date]])","v":1},null,null,null,null,null,null,null,{"$f":"MONTH(Tableau2[[#This Row],[Date]])","v":1}]
[45,{"$f":"MONTH(Tableau1[[#This Row],[Date]])","v":1},null,null,null,null,null,null,null,{"$f":"MONTH(Tableau2[[#This Row],[Date]])","v":1}]
[46,{"$f":"MONTH(Tableau1[[#This Row],[Date]])","v":1},null,null,null,null,null,null,null,{"$f":"MONTH(Tableau2[[#This Row],[Date]])","v":1}]
[47,{"$f":"MONTH(Tableau1[[#This Row],[Date]])","v":1},null,null,null,null,null,null,null,{"$f":"MONTH(Tableau2[[#This Row],[Date]])","v":1}]
[48,{"$f":"MONTH(Tableau1[[#This Row],[Date]])","v":1},null,null,null,null,null,null,null,{"$f":"MONTH(Tableau2[[#This Row],[Date]])","v":1}]
[49,{"$f":"MONTH(Tableau1[[#This Row],[Date]])","v":1},null,null,null,null,null,null,null,{"$f":"MONTH(Tableau2[[#This Row],[Date]])","v":1}]
[50,{"$f":"MONTH(Tableau1[[#This Row],[Date]])","v":1},null,null,null,null,null,null,null,{"$f":"MONTH(Tableau2[[#This Row],[Date]])","v":1}]
[51,{"$f":"MONTH(Tableau1[[#This Row],[Date]])","v":1},null,null,null,null,null,null,null,{"$f":"MONTH(Tableau2[[#This Row],[Date]])","v":1}]
[52,{"$f":"MONTH(Tableau1[[#This Row],[Date]])","v":1},null,null,null,null,null,null,null,{"$f":"MONTH(Tableau2[[#This Row],[Date]])","v":1}]
[53,{"$f":"MONTH(Tableau1[[#This Row],[Date]])","v":1},null,null,null,null,null,null,null,{"$f":"MONTH(Tableau2[[#This Row],[Date]])","v":1}]
[54,{"$f":"MONTH(Tableau1[[#This Row],[Date]])","v":1},null,null,null,null,null,null,null,{"$f":"MONTH(Tableau2[[#This Row],[Date]])","v":1}]
[55,{"$f":"MONTH(Tableau1[[#This Row],[Date]])","v":1},null,null,null,null,null,null,null,{"$f":"MONTH(Tableau2[[#This Row],[Date]])","v":1}]
[56,{"$f":"MONTH(Tableau1[[#This Row],[Date]])","v":1},null,null,null,null,null,null,null,{"$f":"MONTH(Tableau2[[#This Row],[Date]])","v":1}]
[57,{"$f":"MONTH(Tableau1[[#This Row],[Date]])","v":1},null,null,null,null,null,null,null,{"$f":"MONTH(Tableau2[[#This Row],[Date]])","v":1}]
[58,{"$f":"MONTH(Tableau1[[#This Row],[Date]])","v":1},null,null,null,null,null,null,null,{"$f":"MONTH(Tableau2[[#This Row],[Date]])","v":1}]
[59,{"$f":"MONTH(Tableau1[[#This Row],[Date]])","v":1},null,null,null,null,null,null,null,{"$f":"MONTH(Tableau2[[#This Row],[Date]])","v":1}]
[60,{"$f":"MONTH(Tableau1[[#This Row],[Date]])","v":1},null,null,null,null,null,null,null,{"$f":"MONTH(Tableau2[[#This Row],[Date]])","v":1}]
[61,{"$f":"MONTH(Tableau1[[#This Row],[Date]])","v":1},null,null,null,null,null,null,null,{"$f":"MONTH(Tableau2[[#This Row],[Date]])","v":1}]
[62,{"$f":"MONTH(Tableau1[[#This Row],[Date]])","v":1},null,null,null,null,null,null,null,{"$f":"MONTH(Tableau2[[#This Row],[Date]])","v":1}]
[63,{"$f":"MONTH(Tableau1[[#This Row],[Date]])","v":1},null,null,null,null,null,null,null,{"$f":"MONTH(Tableau2[[#This Row],[Date]])","v":1}]
[64,{"$f":"MONTH(Tableau1[[#This Row],[Date]])","v":1},null,null,null,null,null,null,null,{"$f":"MONTH(Tableau2[[#This Row],[Date]])","v":1}]
[65,{"$f":"MONTH(Tableau1[[#This Row],[Date]])","v":1},null,null,null,null,null,null,null,{"$f":"MONTH(Tableau2[[#This Row],[Date]])","v":1}]
[66,{"$f":"MONTH(Tableau1[[#This Row],[Date]])","v":1},null,null,null,null,null,null,null,{"$f":"MONTH(Tableau2[[#This Row],[Date]])","v":1}]
[67,{"$f":"MONTH(Tableau1[[#This Row],[Date]])","v":1},null,null,null,null,null,null,null,{"$f":"MONTH(Tableau2[[#This Row],[Date]])","v":1}]
[68,{"$f":"MONTH(Tableau1[[#This Row],[Date]])","v":1},null,null,null,null,null,null,null,{"$f":"MONTH(Tableau2[[#This Row],[Date]])","v":1}]
[69,{"$f":"MONTH(Tableau1[[#This Row],[Date]])","v":1},null,null,null,null,null,null,null,{"$f":"MONTH(Tableau2[[#This Row],[Date]])","v":1}]
[70,{"$f":"MONTH(Tableau1[[#This Row],[Date]])","v":1},null,null,null,null,null,null,null,{"$f":"MONTH(Tableau2[[#This Row],[Date]])","v":1}]
[71,{"$f":"MONTH(Tableau1[[#This Row],[Date]])","v":1},null,null,null,null,null,null,null,{"$f":"MONTH(Tableau2[[#This Row],[Date]])","v":1}]
[72,{"$f":"MONTH(Tableau1[[#This Row],[Date]])","v":1},null,null,null,null,null,null,null,{"$f":"MONTH(Tableau2[[#This Row],[Date]])","v":1}]
[73,{"$f":"MONTH(Tableau1[[#This Row],[Date]])","v":1},null,null,null,null,null,null,null,{"$f":"MONTH(Tableau2[[#This Row],[Date]])","v":1}]
[74,{"$f":"MONTH(Tableau1[[#This Row],[Date]])","v":1},null,null,null,null,null,null,null,{"$f":"MONTH(Tableau2[[#This Row],[Date]])","v":1}]
{"$rows_left_out":527}
{"sheet":"📊 Synthèse","index":2,"n_rows":31,"n_cols":5,"rows_kept":31,"cut":false,"hidden":false,"merged":[[0,0,0,1],[0,2,0,8],[12,1,12,7]]}
[{"$f":"'👩🏻‍🏫 Bienvenue !'!K7","v":0},null,{"$f":"\"Tableau de bord de \"&'👩🏻‍🏫 Bienvenue !'!I12","v":"Tableau de bord de "}]
[]
[null,"Votre synthèse",{"$f":"'👩🏻‍🏫 Bienvenue !'!I16","v":0}]
[]
[null,"Chiffre d'affaires",{"$f":"SUM(Tableau1[Montant])","v":0}]
[]
[null,"Dépenses",{"$f":"SUM(Tableau2[Montant])","v":0}]
[]
[null,"Résultat",{"$f":"C5-C7","v":0}]
[]
[null,"👩🏻‍🏫",{"$f":"IF(C9>=0,\"Bravo, vous faites du profit ! 👍\",\"Vous perdez de l'argent, encore un effort ! 💪\")","v":"Bravo, vous faites du profit ! 👍"}]
[]
[null,"Ce contenu est soumis au droit d’auteur et est la propriété de Comptes & Formules. Toute représentation ou reproduction non autorisée est passible d’une action en contrefaçon. "]
[]
[]
[null,"En détail"]
[]
[null,{"$f":"'👩🏻‍🏫 Bienvenue !'!I16","v":0},"Recettes","Dépenses","Profit"]
[null,"Janvier",{"$f":"coulisses!C2","v":0},{"$f":"coulisses!D2","v":0},{"$f":"coulisses!E2","v":0}]
[null,"Février",{"$f":"coulisses!C3","v":0},{"$f":"coulisses!D3","v":0},{"$f":"coulisses!E3","v":0}]
[null,"Mars",{"$f":"coulisses!C4","v":0},{"$f":"coulisses!D4","v":0},{"$f":"coulisses!E4","v":0}]
[null,"Avril",{"$f":"coulisses!C5","v":0},{"$f":"coulisses!D5","v":0},{"$f":"coulisses!E5","v":0}]
[null,"Mai",{"$f":"coulisses!C6","v":0},{"$f":"coulisses!D6","v":0},{"$f":"coulisses!E6","v":0}]
[null,"Juin",{"$f":"coulisses!C7","v":0},{"$f":"coulisses!D7","v":0},{"$f":"coulisses!E7","v":0}]
[null,"Juillet",{"$f":"coulisses!C8","v":0},{"$f":"coulisses!D8","v":0},{"$f":"coulisses!E8","v":0}]
[null,"Août",{"$f":"coulisses!C9","v":0},{"$f":"coulisses!D9","v":0},{"$f":"coulisses!E9","v":0}]
[null,"Septembre",{"$f":"coulisses!C10","v":0},{"$f":"coulisses!D10","v":0},{"$f":"coulisses!E10","v":0}]
[null,"Octobre",{"$f":"coulisses!C11","v":0},{"$f":"coulisses!D11","v":0},{"$f":"coulisses!E11","v":0}]
[null,"Novembre",{"$f":"coulisses!C12","v":0},{"$f":"coulisses!D12","v":0},{"$f":"coulisses!E12","v":0}]
[null,"Décembre",{"$f":"coulisses!C13","v":0},{"$f":"coulisses!D13","v":0},{"$f":"coulisses!E13","v":0}]
[null,"TOTAL",{"$f":"SUM(C19:C30)","v":0},{"$f":"SUM(D19:D30)","v":0},0]

{"sheet":"🧾 Facture","index":3,"n_rows":41,"n_cols":13,"rows_kept":41,"cut":false,"hidden":false,"merged":[[16,7,17,7],[16,1,17,1],[16,8,17,8],[45,1,45,8],[24,1,24,2],[24,6,24,8],[28,2,28,8],[36,1,37,8],[44,1,44,8],[21,2,21,5],[16,2,17,5],[18,2,18,5],[19,2,19,5],[20,2,20,5],[16,6,17,6]]}
[]
[null,null,null,null,null,null,"FACTURE N° ",null,{"$f":"IFERROR(VLOOKUP($M$19,'💶 Recettes et dépenses'!A6:H157,5,FALSE),\"\")","v":0}]
[]
[null,"Votre nom"]
[null,"Votre adresse"]
[null,"Votre adresse"]
[null,"Votre adresse",null,null,null,null,{"$f":"IFERROR(VLOOKUP($M$19,'💶 Recettes et dépenses'!A6:H157,6,FALSE),\"\")","v":0}]
[null,null,null,null,null,null,"Adresse du client"]
[null,null,null,null,null,null,"Adresse du client"]
[null,"SIRET : ",null,null,null,null,"Adresse du client"]
[]
[]
[]
[]
[null,null,null,null,null,null,null,"À (lieu), le",{"$f":"TODAY()","v":"2025-12-15"}]
[]
[null,"Date","Libellé",null,null,null,"Qté","PU","Montant"]
[]
[null,{"$f":"IFERROR(VLOOKUP(M19,'💶 Recettes et dépenses'!A:H,3,FALSE),\"\")","v":"00:00:00"},{"$f":"IFERROR(VLOOKUP(M19,'💶 Recettes et dépenses'!A:H,7,FALSE),\"\")","v":0},null,null,null,1,{"$f":"IFERROR(I19/G19,\"\")","v":0},{"$f":"IFERROR(VLOOKUP(M19,'💶 Recettes et dépenses'!A:H,8,FALSE),\"\")","v":0},null,null,"Numéro recette",1]
[null,{"$f":"IFERROR(VLOOKUP(M20,'💶 Recettes et dépenses'!A:H,3,FALSE),\"\")","v":""},{"$f":"IFERROR(VLOOKUP(M20,'💶 Recettes et dépenses'!A:H,7,FALSE),\"\")","v":""},null,null,null,null,{"$f":"IFERROR(I20/G20,\"\")","v":""},{"$f":"IFERROR(VLOOKUP(M20,'💶 Recettes et dépenses'!A:H,8,FALSE),\"\")","v":""},null,null,"Numéro recette"]
[null,{"$f":"IFERROR(VLOOKUP(M21,'💶 Recettes et dépenses'!A:H,3,FALSE),\"\")","v":""},{"$f":"IFERROR(VLOOKUP(M21,'💶 Recettes et dépenses'!A:H,7,FALSE),\"\")","v":""},null,null,null,null,"",{"$f":"IFERROR(VLOOKUP(M21,'💶 Recettes et dépenses'!A:H,8,FALSE),\"\")","v":""},null,null,"Numéro recette"]
[null,{"$f":"IFERROR(VLOOKUP(M22,'💶 Recettes et dépenses'!A:H,3,FALSE),\"\")","v":""},{"$f":"IFERROR(VLOOKUP(M22,'💶 Recettes et dépenses'!A:H,7,FALSE),\"\")","v":""},null,null,null,null,"",{"$f":"IFERROR(VLOOKUP(M22,'💶 Recettes et dépenses'!A:H,8,FALSE),\"\")","v":""},null,null,"Numéro recette"]
[null,null,null,null,null,null,null,"TOTAL HT",{"$f":"SUM(I19:I22)","v":0}]
[null,null,null,null,null,null,null,null,null,null,null,"Comment personnaliser votre modèle de facture :"]
[null,null,null,null,null,null,"TVA non applicable, article 293B du code général des impôts",null,null,null,null,">> Ajoutez votre nom et adresse en haut à droite (et éventuellement votre logo)"]
[null,null,null,null,null,null,null,null,null,null,null,">> Ajoutez votre lieu d'émission de facture après \"À\""]
[null,"Conditions de règlement :",null,null,null,null,null,null,null,null,null,">> Ajoutez votre SIRET"]
[null,"Echéance de paiement :",null,null,null,null,null,null,null,null,null,">> Remplissez les Conditions de règlement et votre IBAN"]
[null,"IBAN :",null,null,null,null,null,null,null,null,null,">> Laissez ou supprimez la mention concernant le TVA et l'immatriculation selon votre situation"]
[null,null,null,null,null,null,null,null,null,null,null,">> Ajoutez le cas échéant les références de votre contrat de médiation"]
[null,null,null,null,null,null,null,null,null,null,null,">> Ajoutez toute autres mentions obligatoires "]
[null,null,null,null,null,null,null,null,null,null,null,">> Vous pouvez changer l'apparence, les couleurs, etc.. à votre convenance sans dépasser la colonne J et la ligne 41 et sans modifier le tableau"]
[null,null,null,null,null,null,null,null,null,null,null,"Comment générer une facture pour votre client :"]
[null,"> Taux de pénalités de retard : 11% et indemnité forfaitaire de 40€HT pour frais de recouvrement",null,null,null,null,null,null,null,null,null,">> Ajoutez l'adresse de votre client"]
[null,"> Pas d'escompte pour paiement anticipé",null,null,null,null,null,null,null,null,null,">> Saisissez les numéros des recettes à facturer ci-dessus (colonne A du livre de recettes)"]
[null,null,null,null,null,null,null,null,null,null,null,">> Vous pouvez soit saisir une ligne par produit dans le livre de recettes et les faire apparaître ici ou saisir les lignes à la main en effaçant les formules, il faut alors saisir seulement la première recette"]
[null,"Dispensé d'immatriculation au registre de commerce et des sociétés (RCS) et au répertoire des métiers (RM)",null,null,null,null,null,null,null,null,null,">> Modifiez les quantités si nécessaires"]
[null,null,null,null,null,null,null,null,null,null,null,">> Masquez les lignes vides si vous le souhaitez"]
[null,null,null,null,null,null,null,null,null,null,null,">> Précisez l'échéance de paiement "]
[null,null,null,null,null,null,null,null,null,null,null,">> Cliquez sur \"Export PDF\""]
[null,null,null,null,null,null,null,null,null,null,null,">>  Recherchez le PDF \"Facture nom du client\" s'il ne s'affiche pas sur le bureau ou dans le dossier où est sauvegardé ce fichier excel"]

{"sheet":"coulisses","index":4,"n_rows":36,"n_cols":9,"rows_kept":36,"cut":false,"hidden":true,"merged":[]}
[null,null,"Recettes","Dépenses","Profit",null,null,null,"CB"]
[1,"Janvier",{"$f":"SUMIF('💶 Recettes et dépenses'!B:B,coulisses!A2,'💶 Recettes et dépenses'!H:H)","v":0},{"$f":"SUMIF('💶 Recettes et dépenses'!J:J,coulisses!A2,'💶 Recettes et dépenses'!O:O)","v":0},{"$f":"C2-D2","v":0},null,null,null,"Espèces"]
[2,"Février",{"$f":"SUMIF('💶 Recettes et dépenses'!B:B,coulisses!A3,'💶 Recettes et dépenses'!H:H)","v":0},{"$f":"SUMIF('💶 Recettes et dépenses'!J:J,coulisses!A3,'💶 Recettes et dépenses'!O:O)","v":0},{"$f":"C3-D3","v":0},null,null,null,"Chèque"]
[3,"Mars",{"$f":"SUMIF('💶 Recettes et dépenses'!B:B,coulisses!A4,'💶 Recettes et dépenses'!H:H)","v":0},{"$f":"SUMIF('💶 Recettes et dépenses'!J:J,coulisses!A4,'💶 Recettes et dépenses'!O:O)","v":0},0,null,null,null,"Virement"]
[4,"Avril",{"$f":"SUMIF('💶 Recettes et dépenses'!B:B,coulisses!A5,'💶 Recettes et dépenses'!H:H)","v":0},{"$f":"SUMIF('💶 Recettes et dépenses'!J:J,coulisses!A5,'💶 Recettes et dépenses'!O:O)","v":0},0,null,null,null,"Paypal"]
[5,"Mai",{"$f":"SUMIF('💶 Recettes et dépenses'!B:B,coulisses!A6,'💶 Recettes et dépenses'!H:H)","v":0},{"$f":"SUMIF('💶 Recettes et dépenses'!J:J,coulisses!A6,'💶 Recettes et dépenses'!O:O)","v":0},0,null,null,null,"Stripe"]
[6,"Juin",{"$f":"SUMIF('💶 Recettes et dépenses'!B:B,coulisses!A7,'💶 Recettes et dépenses'!H:H)","v":0},{"$f":"SUMIF('💶 Recettes et dépenses'!J:J,coulisses!A7,'💶 Recettes et dépenses'!O:O)","v":0},0,null,null,null,"Autre"]
[7,"Juillet",{"$f":"SUMIF('💶 Recettes et dépenses'!B:B,coulisses!A8,'💶 Recettes et dépenses'!H:H)","v":0},{"$f":"SUMIF('💶 Recettes et dépenses'!J:J,coulisses!A8,'💶 Recettes et dépenses'!O:O)","v":0},0]
[8,"Août",{"$f":"SUMIF('💶 Recettes et dépenses'!B:B,coulisses!A9,'💶 Recettes et dépenses'!H:H)","v":0},{"$f":"SUMIF('💶 Recettes et dépenses'!J:J,coulisses!A9,'💶 Recettes et dépenses'!O:O)","v":0},0]
[9,"Septembre",{"$f":"SUMIF('💶 Recettes et dépenses'!B:B,coulisses!A10,'💶 Recettes et dépenses'!H:H)","v":0},{"$f":"SUMIF('💶 Recettes et dépenses'!J:J,coulisses!A10,'💶 Recettes et dépenses'!O:O)","v":0},0]
[10,"Octobre",{"$f":"SUMIF('💶 Recettes et dépenses'!B:B,coulisses!A11,'💶 Recettes et dépenses'!H:H)","v":0},{"$f":"SUMIF('💶 Recettes et dépenses'!J:J,coulisses!A11,'💶 Recettes et dépenses'!O:O)","v":0},0]
[11,"Novembre",{"$f":"SUMIF('💶 Recettes et dépenses'!B:B,coulisses!A12,'💶 Recettes et dépenses'!H:H)","v":0},{"$f":"SUMIF('💶 Recettes et dépenses'!J:J,coulisses!A12,'💶 Recettes et dépenses'!O:O)","v":0},0]
[12,"Décembre",{"$f":"SUMIF('💶 Recettes et dépenses'!B:B,coulisses!A13,'💶 Recettes et dépenses'!H:H)","v":0},{"$f":"SUMIF('💶 Recettes et dépenses'!J:J,coulisses!A13,'💶 Recettes et dépenses'!O:O)","v":0},0]
[]
[]
[]
["🧔🏽"]
["🧔🏼"]
["👩🏾‍🦰 "]
["👵🏻"]
["👱🏼"]
["👩🏿‍🦱"]
["🧑🏼‍🦱"]
["👨🏼‍🦰"]
["👩🏽‍🦱"]
["👩🏻‍🦱 "]
["👨🏾‍🦲"]
["👨🏼‍🦲"]
["👩🏼"]
["🧕🏾"]
["👩🏻"]
["👨🏿‍🦱"]
["👨🏻‍🦳"]
["👩🏾"]
["👨🏻‍🦱"]
["🧑🏾‍🦱"]